Reaction Details
Target3-oxoacyl-[acyl-carrier-protein] synthase 3
LigandBDBM23601
Substrate/CompetitorBDBM3158
Meas. Tech.FabD/FabH Coupled Assay
IC50 470±n/a nM
Citation Nie, ZPerretta, CLu, JSu, YMargosiak, SGajiwala, KSCortez, JNikulin, VYager, KMAppelt, KChu, S Structure-based design, synthesis, and study of potent inhibitors of beta-ketoacyl-acyl carrier protein synthase III as potential antimicrobial agents. J Med Chem48:1596-609 (2005) 
 
3-oxoacyl-[acyl-carrier-protein] synthase 3
Name:3-oxoacyl-[acyl-carrier-protein] synthase 3
Type:Acyltransferase; homodimer
Mol. Mass.:35176.53
Organism:Enterococcus faecalis
Description:The E. faecalis FabH was cloned, and protein was expressed in E. coli.
Residue:321
BDBM23601
BDBM3158
NameBDBM23601
Synonyms:(3-Phenoxybenzoylamino)benzoic acid deriv., 24k | 2-({3-phenoxy-4-[3-(trifluoromethoxy)phenyl]benzene}amido)benzoic acid
TypeSmall organic molecule
Emp. Form.C27H18F3NO5
Mol. Mass.493.4307
SMILESOC(=O)c1ccccc1NC(=O)c1ccc(c(Oc2ccccc2)c1)-c1cccc(OC(F)(F)F)c1