Reaction Details
Target3-oxoacyl-[acyl-carrier-protein] synthase 3
LigandBDBM23614
Substrate/CompetitorBDBM3158
Meas. Tech.FabD/FabH Coupled Assay
IC50 3700±n/a nM
Citation Nie, ZPerretta, CLu, JSu, YMargosiak, SGajiwala, KSCortez, JNikulin, VYager, KMAppelt, KChu, S Structure-based design, synthesis, and study of potent inhibitors of beta-ketoacyl-acyl carrier protein synthase III as potential antimicrobial agents. J Med Chem48:1596-609 (2005) 
 
3-oxoacyl-[acyl-carrier-protein] synthase 3
Name:3-oxoacyl-[acyl-carrier-protein] synthase 3
Type:Acyltransferase; homodimer
Mol. Mass.:35176.53
Organism:Enterococcus faecalis
Description:The E. faecalis FabH was cloned, and protein was expressed in E. coli.
Residue:321
BDBM23614
BDBM3158
NameBDBM23614
Synonyms:2-benzoylamino benzoic acid deriv., 28h | 3-{3-[(2-carboxyphenyl)carbamoyl]phenoxy}benzoic acid
TypeSmall organic molecule
Emp. Form.C21H15NO6
Mol. Mass.377.3469
SMILESOC(=O)c1cccc(Oc2cccc(c2)C(=O)Nc2ccccc2C(O)=O)c1