Reaction Details
TargetAlpha-glucosidase MAL32
LigandBDBM23840
Substrate/CompetitorBDBM23837
Meas. Tech.alpha-Glucosidase Inhibition Assay
pH7±n/a
Temperature310.15±n/a K
IC50 16200±n/a nM
Citation Dodo, KAoyama, ANoguchi-Yachide, TMakishima, MMiyachi, HHashimoto, Y Co-existence of alpha-glucosidase-inhibitory and liver X receptor-regulatory activities and their separation by structural development. Bioorg Med Chem16:4272-85 (2008) 
 
Alpha-glucosidase MAL32
Name:Alpha-glucosidase MAL32
Type:Hydrolase
Mol. Mass.:68132.36
Organism:Saccharomyces cerevisiae
Description:Purchased from Wako Fine Chemicals Co. Ltd.
Residue:584
BDBM23840
BDBM23837
NameBDBM23840
Synonyms:2-[2-(2-phenylethyl)phenyl]-2,3-dihydro-1H-isoindole-1,3-dione PP2P
TypeSmall organic molecule
Emp. Form.C22H17NO2
Mol. Mass.327.3759
SMILESO=C1N(C(=O)c2ccccc12)c1ccccc1CCc1ccccc1