Reaction Details
TargetOxysterols receptor LXR-beta
LigandBDBM19459
Substrate/CompetitorBDBM10852
Meas. Tech.alpha-Glucosidase Inhibition Assay
IC50 22000±n/a nM
Citation Dodo, KAoyama, ANoguchi-Yachide, TMakishima, MMiyachi, HHashimoto, Y Co-existence of alpha-glucosidase-inhibitory and liver X receptor-regulatory activities and their separation by structural development. Bioorg Med Chem16:4272-85 (2008) 
 
Oxysterols receptor LXR-beta
Name:Oxysterols receptor LXR-beta
Type:Enzyme Catalytic Domain
Mol. Mass.:50978.79
Organism:Homo sapiens (Human)
Description:P55055
Residue:460
BDBM19459
BDBM10852
NameBDBM19459
Synonyms:5,7-dihydroxy-3-(4-hydroxyphenyl)-4H-chromen-4-one Genistein Genisteol US8552057, 2 | cid_5280961
TypePhytoestrogen
Emp. Form.C15H10O5
Mol. Mass.270.2369
SMILESOc1ccc(cc1)-c1coc2cc(O)cc(O)c2c1=O