Reaction Details
TargetCoagulation factor X
LigandBDBM23887
Substrate/CompetitorBDBM23925
Meas. Tech.Determination of Inhibition Constants
Ki 10000±n/a nM
Citation Steinmetzer, TSchweinitz, AStürzebecher, ADönnecke, DUhland, KSchuster, OSteinmetzer, PMüller, FFriedrich, RThan, MEBode, WStürzebecher, J Secondary amides of sulfonylated 3-amidinophenylalanine. New potent and selective inhibitors of matriptase. J Med Chem49:4116-26 (2006) 
 
Coagulation factor X
Name:Coagulation factor X
Type:PROTEIN
Mol. Mass.:54498.45
Organism:Bos taurus
Description:ChEMBL_1364435
Residue:492
BDBM23887
BDBM23925
NameBDBM23887
Synonyms:3-amidinophenylalanine deriv., 31 | 4-({4-[(2S)-3-(3-carbamimidoylphenyl)-2-{[2,4,6-tris(propan-2-yl)benzene]sulfonamido}propanoyl]piperazin-1-yl}carbonyl)piperidine-1-carboximidamide
TypeSmall organic molecule
Emp. Form.C36H54N8O4S
Mol. Mass.694.93
SMILESCC(C)c1cc(C(C)C)c(c(c1)C(C)C)S(=O)(=O)N[C@@H](Cc1cccc(c1)C(N)=N)C(=O)N1CCN(CC1)C(=O)C1CCN(CC1)C(N)=N