Reaction Details
TargetGamma-aminobutyric acid (GABA) B receptor 1/type B receptor subunit 2 [41-940]
LigandBDBM24198
Substrate/CompetitorBDBM24183
Meas. Tech.[3H]GABA Filtration Binding Assay (Ki) and FLIPR Assay for Agonism (EC50)
pH7.4±n/a
Temperature295.15±n/a K
Ki 4.3±1.3 nM
EC50 14±3.2 nM
Citation Alstermark, CAmin, KDinn, SRElebring, TFjellström, OFitzpatrick, KGeiss, WBGottfries, JGuzzo, PRHarding, JPHolmén, AKothare, MLehmann, AMattsson, JPNilsson, KSundén, GSwanson, Mvon Unge, SWoo, AMWyle, MJZheng, X Synthesis and pharmacological evaluation of novel gamma-aminobutyric acid type B (GABAB) receptor agonists as gastroesophageal reflux inhibitors. J Med Chem51:4315-20 (2008) 
 
Gamma-aminobutyric acid (GABA) B receptor 1/type B receptor subunit 2 [41-940]
Name:Gamma-aminobutyric acid (GABA) B receptor 1/type B receptor subunit 2 [41-940]
Synonyms:gamma-Aminobutyric Acid Type B Receptor
Type:Heterodimer of GABA-B-R1 and GABA-B-R2.
Mol. Mass.:n/a
Description:Binding assays were using GABAb receptor sites in rat brain synaptic membranes.
Components:This complex has 2 components.
Component 1
Name:Gamma-aminobutyric acid (GABA) B receptor 1
Type:G Protein-Coupled Receptor (GPCR)
Mol. Mass.:108221.06
Organism:Rattus norvegicus (rat)
Description:Q6MFX8
Residue:960
Component 2
Name:Gamma-aminobutyric acid type B receptor subunit 2 [41-940]
Synonyms:G-protein coupled receptor 51 GABA-B-R2 GABR2_RAT Gb2 gamma-Aminobutyric Acid Type B Receptor Subunit 2
Type:G Protein-Coupled Receptor (GPCR)
Mol. Mass.:101631.48
Organism:Rattus norvegicus (rat)
Description:O88871[41-940]
Residue:900
BDBM24198
BDBM24183
NameBDBM24198
Synonyms:3-aminopropylphosphinic derivative, (R)-8 | [(2R)-3-amino-2-fluoropropyl](methyl)phosphinic acid
TypeSmall organic molecule
Emp. Form.C4H11FNO2P
Mol. Mass.155.1078
SMILESCP(O)(=O)C[C@H](F)CN