Reaction Details
TargetDNA gyrase subunit A/B
LigandBDBM24608
Substrate/CompetitorBDBM2
Meas. Tech.DNA Gyrase ATPase Assay
Ki<4±n/a nM
Citation Charifson, PSGrillot, ALGrossman, THParsons, JDBadia, MBellon, SDeininger, DDDrumm, JEGross, CHLeTiran, ALiao, YMani, NNicolau, DPPerola, ERonkin, SShannon, DSwenson, LLTang, QTessier, PRTian, SKTrudeau, MWang, TWei, YZhang, HStamos, D Novel dual-targeting benzimidazole urea inhibitors of DNA gyrase and topoisomerase IV possessing potent antibacterial activity: intelligent design and evolution through the judicious use of structure-guided design and structure-activity relationships. J Med Chem51:5243-63 (2008) 
 
DNA gyrase subunit A/B
Name:DNA gyrase subunit A/B
Type:A2B2 tetramer
Mol. Mass.:n/a
Description:n/a
Components:This complex has 2 components.
Component 1
Name:DNA gyrase subunit A
Synonyms:DNA gyrase GYRA_ECOLI hisW parD
Type:Enzyme Subunit
Mol. Mass.:96935.15
Organism:Escherichia coli (strain K12)
Description:n/a
Residue:875
Component 2
Name:DNA gyrase subunit B
Synonyms:DNA gyrase subunit B GYRB_ECOLI acrB gyrB hisU parA | pcbA
Type:Enzyme Subunit
Mol. Mass.:89941.28
Organism:Escherichia coli (strain K12)
Description:P0AES6
Residue:804
BDBM24608
BDBM2
NameBDBM24608
Synonyms:3-ethyl-1-[7-(1H-pyrazol-1-yl)-5-(pyridin-3-yl)-1H-1,3-benzodiazol-2-yl]urea | Benzimidazole urea analogue, 12
TypeSmall organic molecule
Emp. Form.C18H17N7O
Mol. Mass.347.3739
SMILESCCNC(=O)Nc1nc2c(cc(cc2[nH]1)-c1cccnc1)-n1cccn1