Reaction Details
TargetIndoleamine 2,3-dioxygenase 1
LigandBDBM24656
Substrate/CompetitorBDBM21974
Meas. Tech.Enzyme Inhibition Assay
pH6.5±n/a
Temperature310.15±n/a K
IC50 48000±n/a nM
Citation Kumar, SJaller, DPatel, BLaLonde, JMDuHadaway, JBMalachowski, WPPrendergast, GCMuller, AJ Structure based development of phenylimidazole-derived inhibitors of indoleamine 2,3-dioxygenase. J Med Chem51:4968-77 (2008) 
 
Indoleamine 2,3-dioxygenase 1
Name:Indoleamine 2,3-dioxygenase 1
Type:Enzyme
Mol. Mass.:45330.80
Organism:Homo sapiens (Human)
Description:P14902
Residue:403
BDBM24656
BDBM21974
NameBDBM24656
Synonyms:4-PIM 4-phenyl-1H-imidazole CHEMBL14145 US9144538, 4-Phenylimidazole
TypeSmall organic molecule
Emp. Form.C9H8N2
Mol. Mass.144.1732
SMILESc1nc(c[nH]1)-c1ccccc1