Reaction Details
TargetIndoleamine 2,3-dioxygenase 1
LigandBDBM24786
Substrate/CompetitorBDBM21974
Meas. Tech.Enzyme Inhibition Assay
pH6.5±n/a
Temperature310.15±n/a K
IC50 214±n/a nM
Citation Kumar, SMalachowski, WPDuHadaway, JBLaLonde, JMCarroll, PJJaller, DMetz, RPrendergast, GCMuller, AJ Indoleamine 2,3-dioxygenase is the anticancer target for a novel series of potent naphthoquinone-based inhibitors. J Med Chem51:1706-18 (2008) 
 
Indoleamine 2,3-dioxygenase 1
Name:Indoleamine 2,3-dioxygenase 1
Type:Enzyme
Mol. Mass.:45330.80
Organism:Homo sapiens (Human)
Description:P14902
Residue:403
BDBM24786
BDBM21974
NameBDBM24786
Synonyms:2,2-dimethyl-2H,5H,10H-benzo[g]chromene-5,10-dione | Pyranonaphthoquinone derivative, 23
TypeSmall organic molecule
Emp. Form.C15H12O3
Mol. Mass.240.254
SMILESCC1(C)OC2=C(C=C1)C(=O)c1ccccc1C2=O