Reaction Details
TargetIndoleamine 2,3-dioxygenase 1
LigandBDBM24788
Substrate/CompetitorBDBM21974
Meas. Tech.Enzyme Inhibition Assay
pH6.5±n/a
Temperature310.15±n/a K
IC50 190±n/a nM
Citation Kumar, SMalachowski, WPDuHadaway, JBLaLonde, JMCarroll, PJJaller, DMetz, RPrendergast, GCMuller, AJ Indoleamine 2,3-dioxygenase is the anticancer target for a novel series of potent naphthoquinone-based inhibitors. J Med Chem51:1706-18 (2008) 
 
Indoleamine 2,3-dioxygenase 1
Name:Indoleamine 2,3-dioxygenase 1
Type:Enzyme
Mol. Mass.:45330.80
Organism:Homo sapiens (Human)
Description:P14902
Residue:403
BDBM24788
BDBM21974
NameBDBM24788
Synonyms:6-hydroxy-2,2-dimethyl-2H,5H,10H-benzo[g]chromene-5,10-dione | Pyranonaphthoquinone derivative, 25
TypeSmall organic molecule
Emp. Form.C15H12O4
Mol. Mass.256.2534
SMILESCC1(C)OC2=C(C=C1)C(=O)c1c(O)cccc1C2=O