Reaction Details
TargetIndoleamine 2,3-dioxygenase 1
LigandBDBM24796
Substrate/CompetitorBDBM21974
Meas. Tech.Enzyme Inhibition Assay
IC50 4950±n/a nM
Citation Kumar, SMalachowski, WPDuHadaway, JBLaLonde, JMCarroll, PJJaller, DMetz, RPrendergast, GCMuller, AJ Indoleamine 2,3-dioxygenase is the anticancer target for a novel series of potent naphthoquinone-based inhibitors. J Med Chem51:1706-18 (2008) 
 
Indoleamine 2,3-dioxygenase 1
Name:Indoleamine 2,3-dioxygenase 1
Type:Enzyme
Mol. Mass.:45330.80
Organism:Homo sapiens (Human)
Description:P14902
Residue:403
BDBM24796
BDBM21974
NameBDBM24796
Synonyms:(11S,13S)-14,14-dimethyl-12,15-dioxatetracyclo[8.5.0.0^{3,8}.0^{11,13}]pentadeca-1(10),3(8),4,6-tetraene-2,9-dione | Pyranonaphthoquinone derivative, 33
TypeSmall organic molecule
Emp. Form.C15H12O4
Mol. Mass.256.2534
SMILESCC1(C)OC2=C([C@@H]3O[C@H]13)C(=O)c1ccccc1C2=O