Reaction Details
TargetIndoleamine 2,3-dioxygenase 1
LigandBDBM24801
Substrate/CompetitorBDBM21974
Meas. Tech.Enzyme Inhibition Assay
IC50 130±n/a nM
Citation Kumar, SMalachowski, WPDuHadaway, JBLaLonde, JMCarroll, PJJaller, DMetz, RPrendergast, GCMuller, AJ Indoleamine 2,3-dioxygenase is the anticancer target for a novel series of potent naphthoquinone-based inhibitors. J Med Chem51:1706-18 (2008) 
 
Indoleamine 2,3-dioxygenase 1
Name:Indoleamine 2,3-dioxygenase 1
Type:Enzyme
Mol. Mass.:45330.80
Organism:Homo sapiens (Human)
Description:P14902
Residue:403
BDBM24801
BDBM21974
NameBDBM24801
Synonyms:(3S,4S)-4-(butylamino)-3-hydroxy-2,2-dimethyl-2H,3H,4H,5H,10H-naphtho[2,3-b]pyran-5,10-dione | Pyranonaphthoquinone derivative, 40
TypeSmall organic molecule
Emp. Form.C19H23NO4
Mol. Mass.329.3902
SMILESCCCCN[C@@H]1[C@H](O)C(C)(C)OC2=C1C(=O)c1ccccc1C2=O