Reaction Details
TargetIndoleamine 2,3-dioxygenase 1
LigandBDBM24816
Substrate/CompetitorBDBM21974
Meas. Tech.Enzyme Inhibition Assay
pH6.5±n/a
Temperature310.15±n/a K
Ki 33970±n/a nM
Citation Gaspari, PBanerjee, TMalachowski, WPMuller, AJPrendergast, GCDuHadaway, JBennett, SDonovan, AM Structure-activity study of brassinin derivatives as indoleamine 2,3-dioxygenase inhibitors. J Med Chem49:684-92 (2006) 
 
Indoleamine 2,3-dioxygenase 1
Name:Indoleamine 2,3-dioxygenase 1
Type:Enzyme
Mol. Mass.:45330.80
Organism:Homo sapiens (Human)
Description:P14902
Residue:403
BDBM24816
BDBM21974
NameBDBM24816
Synonyms:Brassinin derivative, 4 | N-[3-(1H-indol-3-yl)propyl](methylsulfanyl)carbothioamide
TypeSmall organic molecule
Emp. Form.C13H16N2S2
Mol. Mass.264.41
SMILESCSC(=S)NCCCc1c[nH]c2ccccc12