Reaction Details
TargetIndoleamine 2,3-dioxygenase 1
LigandBDBM24820
Substrate/CompetitorBDBM21974
Meas. Tech.Enzyme Inhibition Assay
pH6.5±n/a
Temperature310.15±n/a K
Ki 72410±n/a nM
Citation Gaspari, PBanerjee, TMalachowski, WPMuller, AJPrendergast, GCDuHadaway, JBennett, SDonovan, AM Structure-activity study of brassinin derivatives as indoleamine 2,3-dioxygenase inhibitors. J Med Chem49:684-92 (2006) 
 
Indoleamine 2,3-dioxygenase 1
Name:Indoleamine 2,3-dioxygenase 1
Type:Enzyme
Mol. Mass.:45330.80
Organism:Homo sapiens (Human)
Description:P14902
Residue:403
BDBM24820
BDBM21974
NameBDBM24820
Synonyms:Brassinin derivative, 8 | N-benzyl(methylsulfanyl)carbothioamide
TypeSmall organic molecule
Emp. Form.C9H11NS2
Mol. Mass.197.32
SMILESCSC(=S)NCc1ccccc1