Reaction Details
TargetIndoleamine 2,3-dioxygenase 1
LigandBDBM24825
Substrate/CompetitorBDBM21974
Meas. Tech.Enzyme Inhibition Assay
pH6.5±n/a
Temperature310.15±n/a K
Ki 13220±n/a nM
Citation Gaspari, PBanerjee, TMalachowski, WPMuller, AJPrendergast, GCDuHadaway, JBennett, SDonovan, AM Structure-activity study of brassinin derivatives as indoleamine 2,3-dioxygenase inhibitors. J Med Chem49:684-92 (2006) 
 
Indoleamine 2,3-dioxygenase 1
Name:Indoleamine 2,3-dioxygenase 1
Type:Enzyme
Mol. Mass.:45330.80
Organism:Homo sapiens (Human)
Description:P14902
Residue:403
BDBM24825
BDBM21974
NameBDBM24825
Synonyms:(benzylsulfanyl)-N-(1H-indol-3-ylmethyl)carbothioamide | Brassinin derivative, 13
TypeSmall organic molecule
Emp. Form.C17H16N2S2
Mol. Mass.312.452
SMILESS=C(NCc1c[nH]c2ccccc12)SCc1ccccc1