Reaction Details
TargetIndoleamine 2,3-dioxygenase 1
LigandBDBM24828
Substrate/CompetitorBDBM21974
Meas. Tech.Enzyme Inhibition Assay
pH6.5±n/a
Temperature310.15±n/a K
Ki 11550±n/a nM
Citation Gaspari, PBanerjee, TMalachowski, WPMuller, AJPrendergast, GCDuHadaway, JBennett, SDonovan, AM Structure-activity study of brassinin derivatives as indoleamine 2,3-dioxygenase inhibitors. J Med Chem49:684-92 (2006) 
 
Indoleamine 2,3-dioxygenase 1
Name:Indoleamine 2,3-dioxygenase 1
Type:Enzyme
Mol. Mass.:45330.80
Organism:Homo sapiens (Human)
Description:P14902
Residue:403
BDBM24828
BDBM21974
NameBDBM24828
Synonyms:Brassinin derivative, 16 | N-[2-(1H-indol-3-yl)ethyl][(naphthalen-2-ylmethyl)sulfanyl]carbothioamide
TypeSmall organic molecule
Emp. Form.C22H20N2S2
Mol. Mass.376.538
SMILESS=C(NCCc1c[nH]c2ccccc12)SCc1ccc2ccccc2c1