Reaction Details
TargetPhosphatidylinositol 4,5-bisphosphate 3-kinase catalytic subunit alpha isoform
LigandBDBM25041
Substrate/CompetitorBDBM15235
Meas. Tech.Scintillation Proximity Assay
pH7.4±n/a
Temperature295.15±n/a K
IC50 0.26±n/a nM
Citation Hayakawa, MKawaguchi, KKaizawa, HKoizumi, TOhishi, TYamano, MOkada, MOhta, MTsukamoto, SRaynaud, FIParker, PWorkman, PWaterfield, MD Synthesis and biological evaluation of sulfonylhydrazone-substituted imidazo[1,2-a]pyridines as novel PI3 kinase p110alpha inhibitors. Bioorg Med Chem15:5837-44 (2007) 
 
Phosphatidylinositol 4,5-bisphosphate 3-kinase catalytic subunit alpha isoform
Name:Phosphatidylinositol 4,5-bisphosphate 3-kinase catalytic subunit alpha isoform
Type:Enzyme Subunit
Mol. Mass.:124294.87
Organism:Homo sapiens (Human)
Description:P42336
Residue:1068
BDBM25041
BDBM15235
NameBDBM25041
Synonyms:N'-[(1E)-{6-cyanoimidazo[1,2-a]pyridin-3-yl}methylidene]-N,2-dimethyl-5-nitrobenzene-1-sulfonohydrazide | imidazopyridine derivative, 8h
TypeSmall organic molecule
Emp. Form.C17H14N6O4S
Mol. Mass.398.396
SMILESCN(\N=C\c1cnc2ccc(cn12)C#N)S(=O)(=O)c1cc(ccc1C)[N+]([O-])=O