Reaction Details
TargetEnoyl-ACP reductase
LigandBDBM25403
Substrate/CompetitorBDBM8737
Meas. Tech.PfENR Enzymatic Inhibition Assay
pH7.9±n/a
Temperature298.15±n/a K
IC50 49±20 nM
Citation Freundlich, JSWang, FTsai, HCKuo, MShieh, HMAnderson, JWNkrumah, LJValderramos, JCYu, MKumar, TRValderramos, SGJacobs, WRSchiehser, GAJacobus, DPFidock, DASacchettini, JC X-ray structural analysis of Plasmodium falciparum enoyl acyl carrier protein reductase as a pathway toward the optimization of triclosan antimalarial efficacy. J Biol Chem282:25436-44 (2007) 
 
Enoyl-ACP reductase
Name:Enoyl-ACP reductase
Type:Enzyme
Mol. Mass.:49844.02
Organism:Plasmodium falciparum
Description:Q9BJJ9
Residue:432
BDBM25403
BDBM8737
NameBDBM25403
Synonyms:4‐(2,4‐dichlorophenoxy)‐3‐hydroxybenzonitrile (19) Triclosan derivative, 4
TypeSmall organic molecule
Emp. Form.C13H7Cl2NO2
Mol. Mass.280.106
SMILESOc1cc(ccc1Oc1ccc(Cl)cc1Cl)C#N