Reaction Details
TargetEnoyl-ACP reductase
LigandBDBM25410
Substrate/CompetitorBDBM8737
Meas. Tech.PfENR Enzymatic Inhibition Assay
pH7.9±n/a
Temperature298.15±n/a K
IC50 180±80 nM
Citation Freundlich, JSWang, FTsai, HCKuo, MShieh, HMAnderson, JWNkrumah, LJValderramos, JCYu, MKumar, TRValderramos, SGJacobs, WRSchiehser, GAJacobus, DPFidock, DASacchettini, JC X-ray structural analysis of Plasmodium falciparum enoyl acyl carrier protein reductase as a pathway toward the optimization of triclosan antimalarial efficacy. J Biol Chem282:25436-44 (2007) 
 
Enoyl-ACP reductase
Name:Enoyl-ACP reductase
Type:Enzyme
Mol. Mass.:49844.02
Organism:Plasmodium falciparum
Description:Q9BJJ9
Residue:432
BDBM25410
BDBM8737
NameBDBM25410
Synonyms:2-(2,4-dichlorophenoxy)-5-(2-methylpropyl)phenol | Triclosan derivative, 11
TypeSmall organic molecule
Emp. Form.C16H16Cl2O2
Mol. Mass.311.203
SMILESCC(C)Cc1ccc(Oc2ccc(Cl)cc2Cl)c(O)c1