Reaction Details
TargetEnoyl-ACP reductase
LigandBDBM25411
Substrate/CompetitorBDBM8737
Meas. Tech.PfENR Enzymatic Inhibition Assay
pH7.9±n/a
Temperature298.15±n/a K
IC50 290±20 nM
Citation Freundlich, JSWang, FTsai, HCKuo, MShieh, HMAnderson, JWNkrumah, LJValderramos, JCYu, MKumar, TRValderramos, SGJacobs, WRSchiehser, GAJacobus, DPFidock, DASacchettini, JC X-ray structural analysis of Plasmodium falciparum enoyl acyl carrier protein reductase as a pathway toward the optimization of triclosan antimalarial efficacy. J Biol Chem282:25436-44 (2007) 
 
Enoyl-ACP reductase
Name:Enoyl-ACP reductase
Type:Enzyme
Mol. Mass.:49844.02
Organism:Plasmodium falciparum
Description:Q9BJJ9
Residue:432
BDBM25411
BDBM8737
NameBDBM25411
Synonyms:2-(2,4-dichlorophenoxy)-5-(2-methylbutyl)phenol | Triclosan derivative, 12
TypeSmall organic molecule
Emp. Form.C17H18Cl2O2
Mol. Mass.325.23
SMILESCCC(C)Cc1ccc(Oc2ccc(Cl)cc2Cl)c(O)c1