Reaction Details
TargetEnoyl-ACP reductase
LigandBDBM25415
Substrate/CompetitorBDBM8737
Meas. Tech.PfENR Enzymatic Inhibition Assay
pH7.9±n/a
Temperature298.15±n/a K
IC50 410±100 nM
Citation Freundlich, JSWang, FTsai, HCKuo, MShieh, HMAnderson, JWNkrumah, LJValderramos, JCYu, MKumar, TRValderramos, SGJacobs, WRSchiehser, GAJacobus, DPFidock, DASacchettini, JC X-ray structural analysis of Plasmodium falciparum enoyl acyl carrier protein reductase as a pathway toward the optimization of triclosan antimalarial efficacy. J Biol Chem282:25436-44 (2007) 
 
Enoyl-ACP reductase
Name:Enoyl-ACP reductase
Type:Enzyme
Mol. Mass.:49844.02
Organism:Plasmodium falciparum
Description:Q9BJJ9
Residue:432
BDBM25415
BDBM8737
NameBDBM25415
Synonyms:3-chloro-4-[2-hydroxy-4-(2-methylphenyl)phenoxy]benzonitrile | Triclosan derivative, 16
TypeSmall organic molecule
Emp. Form.C20H14ClNO2
Mol. Mass.335.784
SMILESCc1ccccc1-c1ccc(Oc2ccc(cc2Cl)C#N)c(O)c1