Reaction Details
TargetEnoyl-ACP reductase
LigandBDBM25419
Substrate/CompetitorBDBM8737
Meas. Tech.PfENR Enzymatic Inhibition Assay
pH7.9±n/a
Temperature298.15±n/a K
IC50 71±10 nM
Citation Freundlich, JSWang, FTsai, HCKuo, MShieh, HMAnderson, JWNkrumah, LJValderramos, JCYu, MKumar, TRValderramos, SGJacobs, WRSchiehser, GAJacobus, DPFidock, DASacchettini, JC X-ray structural analysis of Plasmodium falciparum enoyl acyl carrier protein reductase as a pathway toward the optimization of triclosan antimalarial efficacy. J Biol Chem282:25436-44 (2007) 
 
Enoyl-ACP reductase
Name:Enoyl-ACP reductase
Type:Enzyme
Mol. Mass.:49844.02
Organism:Plasmodium falciparum
Description:Q9BJJ9
Residue:432
BDBM25419
BDBM8737
NameBDBM25419
Synonyms:5-benzyl-2-(2,4-dichlorophenoxy)phenol | Triclosan derivative, 20
TypeSmall organic molecule
Emp. Form.C19H14Cl2O2
Mol. Mass.345.219
SMILESOc1cc(Cc2ccccc2)ccc1Oc1ccc(Cl)cc1Cl