Reaction Details
TargetAndrogen receptor
LigandBDBM25428
Substrate/CompetitorBDBM18161
Meas. Tech.Androgen Receptor Binding Assay
pH7.4±n/a
Temperature277.15±n/a K
IC50 16±11 nM
Citation Li, JJIula, DMNguyen, MNHu, LYDettling, DJohnson, TRDu, DYShanmugasundaram, VVan Camp, JAWang, ZHarter, WGYue, WSBoys, MLWade, KJDrummond, EMSamas, BMLefker, BAHoge, GSLovdahl, MJAsbill, JCarroll, MMeade, MACiotti, SMKrieger-Burke, T Rational design and synthesis of 4-((1R,2R)-2-hydroxycyclohexyl)-2(trifluoromethyl)benzonitrile (PF-998425), a novel, nonsteroidal androgen receptor antagonist devoid of phototoxicity for dermatological indications. J Med Chem51:7010-4 (2008) 
 
Androgen receptor
Name:Androgen receptor
Type:Receptor
Mol. Mass.:99185.27
Organism:Homo sapiens (Human)
Description:CHO cells were stably transfected with human AR gene.
Residue:920
BDBM25428
BDBM18161
NameBDBM25428
Synonyms:4-[3-(4-hydroxybutyl)-4,4-dimethyl-2,5-dioxoimidazolidin-1-yl]-2-(trifluoromethyl)benzonitrile RU-58841
TypeSmall organic molecule
Emp. Form.C17H18F3N3O3
Mol. Mass.369.3383
SMILESCC1(C)N(CCCCO)C(=O)N(C1=O)c1ccc(C#N)c(c1)C(F)(F)F