Reaction Details
TargetDihydrofolate reductase
LigandBDBM25826
Substrate/CompetitorBDBM18044
Meas. Tech.DHFR Inhibition Assay
pH7±n/a
Temperature298.15±n/a K
IC50 1360±26 nM
Citation Bolstad, DBBolstad, ESFrey, KMWright, DLAnderson, AC Structure-based approach to the development of potent and selective inhibitors of dihydrofolate reductase from cryptosporidium. J Med Chem51:6839-52 (2008) 
 
Dihydrofolate reductase
Name:Dihydrofolate reductase
Type:Enzyme
Mol. Mass.:21453.99
Organism:Homo sapiens (Human)
Description:Recombinant human DHFR.
Residue:187
BDBM25826
BDBM18044
NameBDBM25826
Synonyms:5-[(3R)-3-(3-methoxy-5-phenylphenyl)but-1-yn-1-yl]-6-methylpyrimidine-2,4-diamine | propargyl-based inhibitor, R-10a
TypeSmall organic molecule
Emp. Form.C22H22N4O
Mol. Mass.358.4363
SMILESCOc1cc(cc(c1)-c1ccccc1)[C@@H](C)C#Cc1c(C)nc(N)nc1N