Reaction Details
TargetDipeptidyl peptidase 1
LigandBDBM385049
Substrate/Competitorn/a
Meas. Tech.Fluorescence Assay A1 for Recombinant Human (RH) DPP1
IC50 12.9±n/a nM
Citation Lonn, HRConnolly, SSwallow, SKarlsson, SPAurell, CPontén, JFDoyle, KJVan De Poël, AJJones, GPWatson, DWMacritchie, JAPalmer, NJ Certain (2S)-N-[(1S)-1-cyano-2-phenylethyl]-1,4-oxazepane-2-carboxamides as dipeptidyl peptidase 1 inhibitors US Patent US10287258 Publication Date 5/14/2019
 
Dipeptidyl peptidase 1
Name:Dipeptidyl peptidase 1
Type:Enzyme
Mol. Mass.:51857.28
Organism:Homo sapiens (Human)
Description:P53634
Residue:463
BDBM385049
NameBDBM385049
Synonyms:(2S)-N-{(1S)-1-Cyano-2-[4-(4-methyl-3-oxo-3,4-dihydro-2H-1,4-benzothiazin-6- yl)phenyl]ethyl}-1,4-oxazepane-2-carboxamide US10669245, Example 9 US11655221, Example 9 US11680049, Example 9 | US20230278969, Example 9
TypeSmall organic molecule
Emp. Form.C24H26N4O3S
Mol. Mass.450.553
SMILESCN1C(=O)CSc2ccc(cc12)-c1ccc(C[C@H](NC(=O)[C@@H]2CNCCCO2)C#N)cc1