Reaction Details
TargetDipeptidyl peptidase 1
LigandBDBM385061
Substrate/Competitorn/a
Meas. Tech.Fluorescence Assay A1 for Recombinant Human (RH) DPP1
IC50 8.13±n/a nM
Citation Lonn, HRConnolly, SSwallow, SKarlsson, SPAurell, CPontén, JFDoyle, KJVan De Poël, AJJones, GPWatson, DWMacritchie, JAPalmer, NJ Certain (2S)-N-[(1S)-1-cyano-2-phenylethyl]-1,4-oxazepane-2-carboxamides as dipeptidyl peptidase 1 inhibitors US Patent US10287258 Publication Date 5/14/2019
 
Dipeptidyl peptidase 1
Name:Dipeptidyl peptidase 1
Type:Enzyme
Mol. Mass.:51857.28
Organism:Homo sapiens (Human)
Description:P53634
Residue:463
BDBM385061
NameBDBM385061
Synonyms:(2S)-N-[(1S)-1-Cyano-2-{4-[3-(2-methoxyethyl)-2-oxo-2,3-dihydro-1,3-benzoxazol-5- yl]phenyl}ethyl]-1,4-oxazepane-2-carboxamide US10669245, Example 21 US11655221, Example 21 US11680049, Example 21 | US20230278969, Example 21
TypeSmall organic molecule
Emp. Form.C25H28N4O5
Mol. Mass.464.5136
SMILESCOCCn1c2cc(ccc2oc1=O)-c1ccc(C[C@H](NC(=O)[C@@H]2CNCCCO2)C#N)cc1