Reaction Details
TargetDipeptidyl peptidase 1
LigandBDBM50195239
Substrate/Competitorn/a
Meas. Tech.Fluorescence Assay A1 for Recombinant Human (RH) DPP1
IC50 2.40±n/a nM
Citation Lonn, HRConnolly, SSwallow, SKarlsson, SPAurell, CPontén, JFDoyle, KJVan De Poël, AJJones, GPWatson, DWMacritchie, JAPalmer, NJ Certain (2S)-N-[(1S)-1-cyano-2-phenylethyl]-1,4-oxazepane-2-carboxamides as dipeptidyl peptidase 1 inhibitors US Patent US10287258 Publication Date 5/14/2019
 
Dipeptidyl peptidase 1
Name:Dipeptidyl peptidase 1
Type:Enzyme
Mol. Mass.:51857.28
Organism:Homo sapiens (Human)
Description:P53634
Residue:463
BDBM50195239
NameBDBM50195239
Synonyms:CHEMBL3972563 US10669245, Example 29 US11655221, Example 29 US20230278969, Example 29
TypeSmall organic molecule
Emp. Form.C23H24N4O3S
Mol. Mass.436.527
SMILESCn1c2cc(ccc2sc1=O)-c1ccc(C[C@H](NC(=O)[C@@H]2CNCCCO2)C#N)cc1