Reaction Details
TargetDipeptidyl peptidase 1
LigandBDBM385077
Substrate/Competitorn/a
Meas. Tech.Fluorescence Assay A2 for Recombinant Human (RH) DPP1
IC50 5.25±n/a nM
Citation Lonn, HRConnolly, SSwallow, SKarlsson, SPAurell, CPontén, JFDoyle, KJVan De Poël, AJJones, GPWatson, DWMacritchie, JAPalmer, NJ Certain (2S)-N-[(1S)-1-cyano-2-phenylethyl]-1,4-oxazepane-2-carboxamides as dipeptidyl peptidase 1 inhibitors US Patent US10287258 Publication Date 5/14/2019
 
Dipeptidyl peptidase 1
Name:Dipeptidyl peptidase 1
Type:Enzyme
Mol. Mass.:51857.28
Organism:Homo sapiens (Human)
Description:P53634
Residue:463
BDBM385077
NameBDBM385077
Synonyms:BDBM445985 US11667615, Example 37 US20230278969, Example 37
TypeSmall organic molecule
Emp. Form.C22H32N3O3
Mol. Mass.386.5072
SMILESCC(C)C[C@H](NC(=O)[C@@H]1C[NH2+]CCCO1)\C=C\C(=O)N1CCc2ccccc12