Reaction Details
TargetTyrosine-protein kinase JAK3
LigandBDBM26376
Substrate/CompetitorBDBM17296
Meas. Tech.HTRF Kinase Inhibition Assay
IC50>25000±n/a nM
Citation DiMauro, EFNewcomb, JNunes, JJBemis, JEBoucher, CChai, LChaffee, SCDeak, HLEpstein, LFFaust, TGallant, PGore, AGu, YHenkle, BHsieh, FHuang, XKim, JLLee, JHMartin, MWMcGowan, DCMetz, DMohn, DMorgenstern, KAOliveira-dos-Santos, APatel, VFPowers, DRose, PESchneider, STomlinson, SATudor, YYTurci, SMWelcher, AAZhao, HZhu, LZhu, X Structure-guided design of aminopyrimidine amides as potent, selective inhibitors of lymphocyte specific kinase: synthesis, structure-activity relationships, and inhibition of in vivo T cell activation. J Med Chem51:1681-94 (2008) 
 
Tyrosine-protein kinase JAK3
Name:Tyrosine-protein kinase JAK3
Type:Protein
Mol. Mass.:125111.08
Organism:Homo sapiens (Human)
Description:P52333
Residue:1124
BDBM26376
BDBM17296
NameBDBM26376
Synonyms:4-methyl-3-N-{2-[(1-methylpiperidin-4-yl)amino]pyrimidin-5-yl}-1-N-[3-(trifluoromethyl)benzene]benzene-1,3-dicarboxamide | Aminopyrimidine amide, 13d
TypeSmall organic molecule
Emp. Form.C26H27F3N6O2
Mol. Mass.512.5268
SMILESCN1CCC(CC1)Nc1ncc(NC(=O)c2cc(NC(=O)c3cccc(c3)C(F)(F)F)ccc2C)cn1