Reaction Details
TargetHistamine H4 receptor
LigandBDBM26390
Substrate/CompetitorBDBM7966
Meas. Tech.Radioligand Binding Assay
pH7.4±n/a
Temperature298.15±n/a K
Ki 5±1 nM
Citation Cowart, MDAltenbach, RJLiu, HHsieh, GCDrizin, IMilicic, IMiller, TRWitte, DGWishart, NFix-Stenzel, SRMcPherson, MJAdair, RMWetter, JMBettencourt, BMMarsh, KCSullivan, JPHonore, PEsbenshade, TABrioni, JD Rotationally constrained 2,4-diamino-5,6-disubstituted pyrimidines: a new class of histamine H4 receptor antagonists with improved druglikeness and in vivo efficacy in pain and inflammation models. J Med Chem51:6547-57 (2008) 
 
Histamine H4 receptor
Name:Histamine H4 receptor
Type:G Protein-Coupled Receptor (GPCR)
Mol. Mass.:44517.02
Organism:Homo sapiens (Human)
Description:Binding assays were using CHO cells stably expressing hH4R receptors.
Residue:390
BDBM26390
BDBM7966
NameBDBM26390
Synonyms:4-(4-methylpiperazin-1-yl)-6-phenylpyrimidin-2-amine | 6-aryl-2-aminopyrimidine, 3
TypeSmall organic molecule
Emp. Form.C15H19N5
Mol. Mass.269.3449
SMILESCN1CCN(CC1)c1cc(nc(N)n1)-c1ccccc1