Reaction Details
TargetFatty-acid amide hydrolase 1
LigandBDBM26757
Substrate/CompetitorBDBM22988
Meas. Tech.FAAH Inhibition Assay
pH9±n/a
Temperature295.15±n/a K
IC50 5.3±1.6 nM
Citation Sit, SYConway, CBertekap, RXie, KBourin, CBurris, KDeng, H Novel inhibitors of fatty acid amide hydrolase. Bioorg Med Chem Lett17:3287-91 (2007) 
 
Fatty-acid amide hydrolase 1
Name:Fatty-acid amide hydrolase 1
Type:Protein
Mol. Mass.:63071.19
Organism:Homo sapiens (Human)
Description:O00519
Residue:579
BDBM26757
BDBM22988
NameBDBM26757
Synonyms:bisarylimidazole derivative, 16 | phenyl N-[6-(2-methyl-4,5-diphenyl-1H-imidazol-1-yl)hexyl]carbamate
TypeSmall organic molecule
Emp. Form.C29H31N3O2
Mol. Mass.453.5753
SMILESCc1nc(c(-c2ccccc2)n1CCCCCCNC(=O)Oc1ccccc1)-c1ccccc1