Reaction Details
TargetCannabinoid receptor 1
LigandBDBM27337
Substrate/CompetitorBDBM21278
Meas. Tech.CB Receptor Binding Assay
pH7.4±n/a
Temperature303.15±n/a K
Ki 0.7±0.1 nM
Citation Griffith, DAHadcock, JRBlack, SCIredale, PACarpino, PADaSilva-Jardine, PDay, RDiBrino, JDow, RLLandis, MSO'Connor, REScott, DO Discovery of 1-[9-(4-chlorophenyl)-8-(2-chlorophenyl)-9H-purin-6-yl]-4-ethylaminopiperidine-4-carboxylic acid amide hydrochloride (CP-945,598), a novel, potent, and selective cannabinoid type 1 receptor antagonist. J Med Chem52:234-7 (2009) 
 
Cannabinoid receptor 1
Name:Cannabinoid receptor 1
Type:G Protein-Coupled Receptor (GPCR)
Mol. Mass.:52868.96
Organism:Homo sapiens (Human)
Description:P21554
Residue:472
BDBM27337
BDBM21278
NameBDBM27337
Synonyms:1-[8-(2-chlorophenyl)-9-(4-chlorophenyl)-9H-purin-6-yl]-4-(ethylamino)piperidine-4-carboxamide | CP-945,598
TypeSmall organic molecule
Emp. Form.C25H25Cl2N7O
Mol. Mass.510.418
SMILESCCNC1(CCN(CC1)c1ncnc2n(c(nc12)-c1ccccc1Cl)-c1ccc(Cl)cc1)C(N)=O