Reaction Details
TargetCannabinoid receptor 1
LigandBDBM27338
Substrate/CompetitorBDBM21278
Meas. Tech.CB Receptor Binding Assay
pH7.4±n/a
Temperature303.15±n/a K
Ki 7.4±2.0 nM
Citation Griffith, DAHadcock, JRBlack, SCIredale, PACarpino, PADaSilva-Jardine, PDay, RDiBrino, JDow, RLLandis, MSO'Connor, REScott, DO Discovery of 1-[9-(4-chlorophenyl)-8-(2-chlorophenyl)-9H-purin-6-yl]-4-ethylaminopiperidine-4-carboxylic acid amide hydrochloride (CP-945,598), a novel, potent, and selective cannabinoid type 1 receptor antagonist. J Med Chem52:234-7 (2009) 
 
Cannabinoid receptor 1
Name:Cannabinoid receptor 1
Type:G Protein-Coupled Receptor (GPCR)
Mol. Mass.:52868.96
Organism:Homo sapiens (Human)
Description:P21554
Residue:472
BDBM27338
BDBM21278
NameBDBM27338
Synonyms:9-(4-chlorophenyl)-8-(2,4-dichlorophenyl)-N-(piperidin-1-yl)-9H-purin-6-amine | Purine antagonist, 3b
TypeSmall organic molecule
Emp. Form.C22H19Cl3N6
Mol. Mass.473.785
SMILESClc1ccc(cc1)-n1c(nc2c(NN3CCCCC3)ncnc12)-c1ccc(Cl)cc1Cl