Reaction Details
TargetBeta-2 adrenergic receptor
LigandBDBM27960
Substrate/CompetitorBDBM25747
Meas. Tech.Beta-2 Adrenergic Receptor Binding Assay
pH7.4±n/a
Temperature295.15±n/a K
Ki 1±n/a nM
IC50 3±n/a nM
Citation Kern, CMeyer, TDroux, SSchollmeyer, DMiculka, C Synthesis and pharmacological characterization of beta2-adrenergic agonist enantiomers: zilpaterol. J Med Chem52:1773-7 (2009) 
 
Beta-2 adrenergic receptor
Name:Beta-2 adrenergic receptor
Type:n/a
Mol. Mass.:46461.69
Organism:Homo sapiens (Human)
Description:P07550
Residue:413
BDBM27960
BDBM25747
NameBDBM27960
Synonyms:(2R,3S)-1-[(7-methyl-2,3-dihydro-1H-inden-4-yl)oxy]-3-(propan-2-ylamino)butan-2-ol ICI118551
TypeSmall organic molecule
Emp. Form.C17H27NO2
Mol. Mass.277.4018
SMILESCC(C)N[C@@H](C)[C@@H](O)COc1ccc(C)c2CCCc12