Reaction Details
TargetAdenosine deaminase
LigandBDBM28383
Substrate/CompetitorBDBM14487
Meas. Tech.ADA Enzyme Inhibition Assay
pH7.2±n/a
Temperature303.15±n/a K
Ki 510±42 nM
Citation La Motta, CSartini, SMugnaini, LSalerno, SSimorini, FTaliani, SMarini, AMDa Settimo, FLavecchia, ANovellino, EAntonioli, LFornai, MBlandizzi, CDel Tacca, M Exploiting the pyrazolo[3,4-d]pyrimidin-4-one ring system as a useful template to obtain potent adenosine deaminase inhibitors. J Med Chem52:1681-92 (2009) 
 
Adenosine deaminase
Name:Adenosine deaminase
Type:Enzyme
Mol. Mass.:40910.44
Organism:Bos taurus (bovine)
Description:n/a
Residue:363
BDBM28383
BDBM14487
NameBDBM28383
Synonyms:N-[4-({4-oxo-2H,4H,5H-pyrazolo[3,4-d]pyrimidin-2-yl}methyl)phenyl]-4-(trifluoromethyl)benzamide | pyrazolo[3,4-d]pyrimidin-4-one, 13d
TypeSmall organic molecule
Emp. Form.C20H14F3N5O2
Mol. Mass.413.3527
SMILESFC(F)(F)c1ccc(cc1)C(=O)Nc1ccc(Cn2cc3c(n2)nc[nH]c3=O)cc1