Reaction Details
TargetReceptor-interacting serine/threonine-protein kinase 3
LigandBDBM392810
Substrate/Competitorn/a
Meas. Tech.RIPK3 HTRF Kinase Assay
IC50<30±n/a nM
Citation Hart, ACPitts, WJMastalerz, HGuo, JBrown, GD Substituted dihydro-1H-pyrrolo[3,2-c]pyridin-4(5H)-ones as RIPK3 inhibitors US Patent US10301306 Publication Date 5/28/2019
 
Receptor-interacting serine/threonine-protein kinase 3
Name:Receptor-interacting serine/threonine-protein kinase 3
Type:PROTEIN
Mol. Mass.:56886.12
Organism:Homo sapiens (Human)
Description:ChEMBL_881455
Residue:518
BDBM392810
NameBDBM392810
Synonyms:N-(4-(1-(2-Fluoro-4-(trifluoromethyl)benzyl)-3-(4-fluorophenyl)-4-oxo-4,5,6,7-tetrahydro-1H-pyrrolo[3,2-c]pyridin-2-yl)pyridin-2-yl)cyclopropanecarboxamide | US10301306, Example 8
TypeSmall organic molecule
Emp. Form.C30H23F5N4O2
Mol. Mass.566.5212
SMILESFc1ccc(cc1)-c1c2c(CCNC2=O)n(Cc2ccc(cc2F)C(F)(F)F)c1-c1ccnc(NC(=O)C2CC2)c1