Reaction Details
TargetReceptor-interacting serine/threonine-protein kinase 3
LigandBDBM392848
Substrate/Competitorn/a
Meas. Tech.RIPK3 HTRF Kinase Assay
IC50<30±n/a nM
Citation Hart, ACPitts, WJMastalerz, HGuo, JBrown, GD Substituted dihydro-1H-pyrrolo[3,2-c]pyridin-4(5H)-ones as RIPK3 inhibitors US Patent US10301306 Publication Date 5/28/2019
 
Receptor-interacting serine/threonine-protein kinase 3
Name:Receptor-interacting serine/threonine-protein kinase 3
Type:PROTEIN
Mol. Mass.:56886.12
Organism:Homo sapiens (Human)
Description:ChEMBL_881455
Residue:518
BDBM392848
NameBDBM392848
Synonyms:US10301306, Example 46
TypeSmall organic molecule
Emp. Form.C26H21F2N3O
Mol. Mass.429.4612
SMILESCc1cc(Cn2c3CCNC(=O)c3c(c2-c2ccncc2)-c2ccc(F)cc2)ccc1F