Reaction Details
TargetReceptor-interacting serine/threonine-protein kinase 3
LigandBDBM392866
Substrate/Competitorn/a
Meas. Tech.RIPK3 HTRF Kinase Assay
IC50<30±n/a nM
Citation Hart, ACPitts, WJMastalerz, HGuo, JBrown, GD Substituted dihydro-1H-pyrrolo[3,2-c]pyridin-4(5H)-ones as RIPK3 inhibitors US Patent US10301306 Publication Date 5/28/2019
 
Receptor-interacting serine/threonine-protein kinase 3
Name:Receptor-interacting serine/threonine-protein kinase 3
Type:PROTEIN
Mol. Mass.:56886.12
Organism:Homo sapiens (Human)
Description:ChEMBL_881455
Residue:518
BDBM392866
NameBDBM392866
Synonyms:US10301306, Example 64
TypeSmall organic molecule
Emp. Form.C25H18F3N3O
Mol. Mass.433.4251
SMILESFc1ccc(cc1)-c1c2c(CCNC2=O)n(Cc2ccc(F)cc2F)c1-c1ccncc1