Reaction Details
TargetReceptor-interacting serine/threonine-protein kinase 3
LigandBDBM392868
Substrate/Competitorn/a
Meas. Tech.RIPK3 HTRF Kinase Assay
IC50<30±n/a nM
Citation Hart, ACPitts, WJMastalerz, HGuo, JBrown, GD Substituted dihydro-1H-pyrrolo[3,2-c]pyridin-4(5H)-ones as RIPK3 inhibitors US Patent US10301306 Publication Date 5/28/2019
 
Receptor-interacting serine/threonine-protein kinase 3
Name:Receptor-interacting serine/threonine-protein kinase 3
Type:PROTEIN
Mol. Mass.:56886.12
Organism:Homo sapiens (Human)
Description:ChEMBL_881455
Residue:518
BDBM392868
NameBDBM392868
Synonyms:US10301306, Example 66
TypeSmall organic molecule
Emp. Form.C24H19FN4O
Mol. Mass.398.4323
SMILESFc1ccc(cc1)-c1c2c(CCNC2=O)n(Cc2ccncc2)c1-c1ccncc1