Reaction Details
TargetPeroxisome proliferator-activated receptor alpha
LigandBDBM28771
Substrate/CompetitorBDBM10852
Meas. Tech.Cell-Based Transcription Assay
EC50>10000±n/a nM
Citation Epple, RAzimioara, MRusso, RXie, YWang, XCow, CWityak, JKaranewsky, DBursulaya, BKreusch, ATuntland, TGerken, AIskandar, MSaez, EMartin Seidel, HTian, SS 3,4,5-Trisubstituted isoxazoles as novel PPARdelta agonists. Part 2. Bioorg Med Chem Lett16:5488-92 (2006) 
 
Peroxisome proliferator-activated receptor alpha
Name:Peroxisome proliferator-activated receptor alpha
Type:Enzyme
Mol. Mass.:52222.08
Organism:Homo sapiens (Human)
Description:Q07869
Residue:468
BDBM28771
BDBM10852
NameBDBM28771
Synonyms:2-[3-(4-{[2-(2,4-dichlorophenoxy)ethyl]carbamoyl}-5-phenyl-1,2-oxazol-3-yl)-4-methoxyphenyl]acetic acid | trisubstituted isoxazole, 17f
TypeSmall organic molecule
Emp. Form.C27H22Cl2N2O6
Mol. Mass.541.379
SMILESCOc1ccc(CC(O)=O)cc1-c1noc(c1C(=O)NCCOc1ccc(Cl)cc1Cl)-c1ccccc1