Reaction Details
TargetPeroxisome proliferator-activated receptor alpha
LigandBDBM28774
Substrate/CompetitorBDBM10852
Meas. Tech.Cell-Based Transcription Assay
EC50>10000±n/a nM
Citation Epple, RAzimioara, MRusso, RXie, YWang, XCow, CWityak, JKaranewsky, DBursulaya, BKreusch, ATuntland, TGerken, AIskandar, MSaez, EMartin Seidel, HTian, SS 3,4,5-Trisubstituted isoxazoles as novel PPARdelta agonists. Part 2. Bioorg Med Chem Lett16:5488-92 (2006) 
 
Peroxisome proliferator-activated receptor alpha
Name:Peroxisome proliferator-activated receptor alpha
Type:Enzyme
Mol. Mass.:52222.08
Organism:Homo sapiens (Human)
Description:Q07869
Residue:468
BDBM28774
BDBM10852
NameBDBM28774
Synonyms:2-[3-(4-{[2-(2,4-dichlorophenoxy)ethyl]carbamoyl}-5-(2-methylphenyl)-1,2-oxazol-3-yl)phenyl]acetic acid | trisubstituted isoxazole, 17i
TypeSmall organic molecule
Emp. Form.C27H22Cl2N2O5
Mol. Mass.525.38
SMILESCc1ccccc1-c1onc(c1C(=O)NCCOc1ccc(Cl)cc1Cl)-c1cccc(CC(O)=O)c1