Reaction Details
TargetPeroxisome proliferator-activated receptor gamma
LigandBDBM28764
Substrate/CompetitorBDBM10852
Meas. Tech.Cell-Based Transcription Assay
EC50>10000±n/a nM
Citation Epple, RAzimioara, MRusso, RXie, YWang, XCow, CWityak, JKaranewsky, DBursulaya, BKreusch, ATuntland, TGerken, AIskandar, MSaez, EMartin Seidel, HTian, SS 3,4,5-Trisubstituted isoxazoles as novel PPARdelta agonists. Part 2. Bioorg Med Chem Lett16:5488-92 (2006) 
 
Peroxisome proliferator-activated receptor gamma
Name:Peroxisome proliferator-activated receptor gamma
Type:Nuclear Receptor
Mol. Mass.:57613.46
Organism:Homo sapiens (Human)
Description:P37231
Residue:505
BDBM28764
BDBM10852
NameBDBM28764
Synonyms:2-[3-chloro-4-(4-{[2-(2,4-dichlorophenoxy)ethyl]carbamoyl}-5-phenyl-1,2-oxazol-3-yl)phenyl]acetic acid trisubstituted isoxazole, 1
TypeSmall organic molecule
Emp. Form.C26H19Cl3N2O5
Mol. Mass.545.798
SMILESOC(=O)Cc1ccc(-c2noc(c2C(=O)NCCOc2ccc(Cl)cc2Cl)-c2ccccc2)c(Cl)c1