Reaction Details
TargetPeroxisome proliferator-activated receptor gamma
LigandBDBM28768
Substrate/CompetitorBDBM10852
Meas. Tech.Cell-Based Transcription Assay
EC50>10000±n/a nM
Citation Epple, RAzimioara, MRusso, RXie, YWang, XCow, CWityak, JKaranewsky, DBursulaya, BKreusch, ATuntland, TGerken, AIskandar, MSaez, EMartin Seidel, HTian, SS 3,4,5-Trisubstituted isoxazoles as novel PPARdelta agonists. Part 2. Bioorg Med Chem Lett16:5488-92 (2006) 
 
Peroxisome proliferator-activated receptor gamma
Name:Peroxisome proliferator-activated receptor gamma
Type:Nuclear Receptor
Mol. Mass.:57613.46
Organism:Homo sapiens (Human)
Description:P37231
Residue:505
BDBM28768
BDBM10852
NameBDBM28768
Synonyms:2-[4-(4-{[2-(2,4-dichlorophenoxy)ethyl]carbamoyl}-5-phenyl-1,2-oxazol-3-yl)-2-methylphenoxy]acetic acid | trisubstituted isoxazole, 17c
TypeSmall organic molecule
Emp. Form.C27H22Cl2N2O6
Mol. Mass.541.379
SMILESCc1cc(ccc1OCC(O)=O)-c1noc(c1C(=O)NCCOc1ccc(Cl)cc1Cl)-c1ccccc1