Reaction Details
TargetDihydroorotate dehydrogenase (quinone), mitochondrial
LigandBDBM24400
Substrate/CompetitorBDBM14700
Meas. Tech.DHODH Inhibition Assay
pH8±n/a
Temperature293.15±n/a K
IC50 47±20 nM
Citation Gujjar, RMarwaha, AEl Mazouni, FWhite, JWhite, KLCreason, SShackleford, DMBaldwin, JCharman, WNBuckner, FSCharman, SRathod, PKPhillips, MA Identification of a metabolically stable triazolopyrimidine-based dihydroorotate dehydrogenase inhibitor with antimalarial activity in mice. J Med Chem52:1864-72 (2009) 
 
Dihydroorotate dehydrogenase (quinone), mitochondrial
Name:Dihydroorotate dehydrogenase (quinone), mitochondrial
Type:Enzyme
Mol. Mass.:65581.88
Organism:Plasmodium falciparum (isolate 3D7)
Description:Q08210
Residue:569
BDBM24400
BDBM14700
NameBDBM24400
Synonyms:5-methyl-N-(naphthalen-2-yl)-[1,2,4]triazolo[1,5-a]pyrimidin-7-amine Triazolopyrimidine-Based Compound, 7
TypeSmall organic molecule
Emp. Form.C16H13N5
Mol. Mass.275.3079
SMILESCc1cc(Nc2ccc3ccccc3c2)n2ncnc2n1