Reaction Details
TargetDihydroorotate dehydrogenase (quinone), mitochondrial [100-517]
LigandBDBM24400
Substrate/CompetitorBDBM14700
Meas. Tech.DHODH Inhibition Assay
IC50 230±n/a nM
Citation Gujjar, RMarwaha, AEl Mazouni, FWhite, JWhite, KLCreason, SShackleford, DMBaldwin, JCharman, WNBuckner, FSCharman, SRathod, PKPhillips, MA Identification of a metabolically stable triazolopyrimidine-based dihydroorotate dehydrogenase inhibitor with antimalarial activity in mice. J Med Chem52:1864-72 (2009) 
 
Dihydroorotate dehydrogenase (quinone), mitochondrial [100-517]
Name:Dihydroorotate dehydrogenase (quinone), mitochondrial [100-517]
Type:Enzyme
Mol. Mass.:47311.25
Organism:Plasmodium berghei
Description:A0A509AEH5[100-517]
Residue:418
BDBM24400
BDBM14700
NameBDBM24400
Synonyms:5-methyl-N-(naphthalen-2-yl)-[1,2,4]triazolo[1,5-a]pyrimidin-7-amine Triazolopyrimidine-Based Compound, 7
TypeSmall organic molecule
Emp. Form.C16H13N5
Mol. Mass.275.3079
SMILESCc1cc(Nc2ccc3ccccc3c2)n2ncnc2n1