Reaction Details
TargetAromatase
LigandBDBM29227
Substrate/CompetitorBDBM29231
Meas. Tech.QR2 Assay and IC50 Value Determination
IC50 100±n/a nM
Citation Maiti, AReddy, PVSturdy, MMarler, LPegan, SDMesecar, ADPezzuto, JMCushman, M Synthesis of casimiroin and optimization of its quinone reductase 2 and aromatase inhibitory activities. J Med Chem52:1873-84 (2009) 
 
Aromatase
Name:Aromatase
Type:Enzyme
Mol. Mass.:57888.92
Organism:Homo sapiens (Human)
Description:P11511
Residue:503
BDBM29227
BDBM29231
NameBDBM29227
Synonyms:casimiroin analogue, 1p
TypeSmall organic molecule
Emp. Form.C14H17NO4
Mol. Mass.263.2891
SMILESCOc1cc(OC)c2n(C)c(=O)cc(C)c2c1OC