Reaction Details
TargetTyrosine-protein kinase BTK
LigandBDBM350324
Substrate/Competitorn/a
Meas. Tech.BTK Inhibition Assay
IC50<2.51±n/a nM
Citation Lawson, JDSabat, MScorah, NSmith, CVu, PHWang, H Pyridinyl and fused pyridinyl triazolone derivatives US Patent US10307414 Publication Date 6/4/2019
 
Tyrosine-protein kinase BTK
Name:Tyrosine-protein kinase BTK
Type:Enzyme
Mol. Mass.:76289.95
Organism:Homo sapiens (Human)
Description:Q06187
Residue:659
BDBM350324
NameBDBM350324
Synonyms:(S)-3-(1-((1-acryloylpyrrolidin-3-yl)amino)isoquinolin-3-yl)-1H-1,2,4-triazol-5(4H)-one US9801872, Example 8
TypeSmall organic molecule
Emp. Form.C18H18N6O2
Mol. Mass.350.3745
SMILESC=CC(=O)N1CC[C@@H](C1)Nc1nc(cc2ccccc12)-c1n[nH]c(=O)[nH]1