Reaction Details
TargetTyrosine-protein kinase BTK
LigandBDBM350339
Substrate/Competitorn/a
Meas. Tech.BTK Inhibition Assay
IC50<1.26±n/a nM
Citation Lawson, JDSabat, MScorah, NSmith, CVu, PHWang, H Pyridinyl and fused pyridinyl triazolone derivatives US Patent US10307414 Publication Date 6/4/2019
 
Tyrosine-protein kinase BTK
Name:Tyrosine-protein kinase BTK
Type:Enzyme
Mol. Mass.:76289.95
Organism:Homo sapiens (Human)
Description:Q06187
Residue:659
BDBM350339
NameBDBM350339
Synonyms:(S)-3-(1-((1-acryloylpyrrolidin-3-yl)amino)-8-fluoroisoquinolin-3-yl)-1H-1,2,4-triazol-5(4H)-one US9801872, Example 23
TypeSmall organic molecule
Emp. Form.C18H17FN6O2
Mol. Mass.368.365
SMILESFc1cccc2cc(nc(N[C@H]3CCN(C3)C(=O)C=C)c12)-c1n[nH]c(=O)[nH]1