Reaction Details
TargetTyrosine-protein kinase BTK
LigandBDBM350340
Substrate/Competitorn/a
Meas. Tech.BTK Inhibition Assay
IC50<1.26±n/a nM
Citation Lawson, JDSabat, MScorah, NSmith, CVu, PHWang, H Pyridinyl and fused pyridinyl triazolone derivatives US Patent US10307414 Publication Date 6/4/2019
 
Tyrosine-protein kinase BTK
Name:Tyrosine-protein kinase BTK
Type:Enzyme
Mol. Mass.:76289.95
Organism:Homo sapiens (Human)
Description:Q06187
Residue:659
BDBM350340
NameBDBM350340
Synonyms:(S)-3-(1-((1-acryloylpyrrolidin-3-yl)oxy)-7-chloroisoquinolin-3-yl)-1H-1,2,4-triazol-5(4H)-one US9801872, Example 24
TypeSmall organic molecule
Emp. Form.C18H16ClN5O3
Mol. Mass.385.804
SMILESClc1ccc2cc(nc(O[C@H]3CCN(C3)C(=O)C=C)c2c1)-c1n[nH]c(=O)[nH]1