Reaction Details
TargetPeroxisome proliferator-activated receptor delta
LigandBDBM29872
Substrate/CompetitorBDBM28662
Meas. Tech.Scintillation Proximity Assay (Ki) and Cell-Based Transcription Assay (EC50)
Ki 36±n/a nM
EC50 2900±n/a nM
Citation Connors, RVWang, ZHarrison, MZhang, AWanska, MHiscock, SFox, BDore, MLabelle, MSudom, AJohnstone, SLiu, JWalker, NPChai, ASiegler, KLi, YCoward, P Identification of a PPARdelta agonist with partial agonistic activity on PPARgamma. Bioorg Med Chem Lett19:3550-4 (2009) 
 
Peroxisome proliferator-activated receptor delta
Name:Peroxisome proliferator-activated receptor delta
Type:Enzyme
Mol. Mass.:49910.45
Organism:Homo sapiens (Human)
Description:Q03181
Residue:441
BDBM29872
BDBM28662
NameBDBM29872
Synonyms:phenoxyacetic acid-ether, 14
TypeSmall organic molecule
Emp. Form.C30H26F3NO5S
Mol. Mass.569.591
SMILESCc1c(C)c(Sc2ccc(COc3ccc(cc3)C(F)(F)F)cc2OCc2cccnc2)ccc1OCC(O)=O